{"text_format":"1","workbook":"xlsx","n_sheets":13,"sheets":["图表","总表","经历点数与履历","角色简介与天命","角色专属技能","武器","防具","各种技能","被动战技与战术","特殊战技与姿态战术","魔法","社群与职业","坐骑"],"not_rendered":{"charts":5,"images":0,"macros":1,"external_links":0,"defined_names":1,"comments":5,"pivot_tables":0},"unopened":[],"bounds":{"document_bytes":16777216,"sheet_cells":100000,"rows_first":2000,"rows_last":500,"rows_between":2000,"halvings":0,"cell_chars":16384,"cell_head_chars":4096},"cells_cut":0,"cells_raw":0,"read":"whole","date_system":"1900"}

{"sheet":"图表","index":0,"n_rows":0,"n_cols":0,"rows_kept":0,"cut":false,"hidden":false,"merged":[]}

{"sheet":"总表","index":1,"n_rows":51,"n_cols":36,"rows_kept":51,"cut":false,"hidden":false,"merged":[[22,13,22,14],[22,16,22,17],[22,19,22,20],[8,0,11,0],[17,0,19,0],[20,0,22,0],[1,5,2,5],[3,5,4,5],[5,5,6,5],[7,5,8,5],[9,5,10,5],[11,5,12,5],[8,1,11,3],[17,1,19,3],[20,1,22,3],[19,13,19,14],[19,16,19,17],[19,19,19,20],[20,5,20,8],[20,9,20,10],[20,13,20,14],[20,16,20,17],[20,19,20,20],[21,13,21,14],[21,16,21,17],[21,19,21,20],[18,13,18,14],[18,16,18,17],[18,19,18,20],[18,23,18,24],[18,25,18,26],[18,27,18,28],[18,29,18,30],[18,31,18,32],[18,33,18,34],[10,22,18,22],[16,33,16,34],[17,13,17,14],[17,16,17,17],[17,19,17,20],[17,23,17,24],[17,25,17,26],[17,27,17,28],[17,29,17,30],[17,31,17,32],[17,33,17,34],[14,31,14,32],[14,33,14,34],[15,33,15,34],[12,33,12,34],[13,33,13,34],[11,12,11,14],[11,15,11,17],[11,18,11,19],[11,23,11,24],[11,25,11,26],[11,27,11,28],[16,1,16,3],[16,13,16,14],[16,16,16,17],[16,19,16,20],[16,23,16,24],[16,25,16,26],[16,27,16,28],[16,29,16,30],[16,31,16,32],[15,2,15,3],[15,13,15,14],[15,16,15,17],[15,19,15,20],[15,23,15,24],[15,25,15,26],[15,27,15,28],[15,29,15,30],[15,31,15,32],[14,2,14,3],[14,5,14,10],[14,13,14,14],[14,16,14,17],[14,19,14,20],[14,23,14,24],[14,25,14,26],[14,27,14,28],[14,29,14,30],[13,2,13,3],[13,13,13,14],[13,16,13,17],[13,19,13,20],[13,23,13,24],[13,25,13,26],[13,27,13,28],[13,29,13,30],[13,31,13,32],[12,0,12,3],[12,12,12,14],[12,15,12,17],[12,18,12,20],[12,23,12,24],[12,25,12,26],[12,27,12,28],[12,29,12,30],[12,31,12,32],[11,29,11,30],[11,31,11,32],[11,33,11,34],[9,23,9,24],[9,25,9,26],[9,27,9,28],[9,29,9,30],[9,31,9,32],[9,33,9,34],[10,12,10,20],[10,23,10,24],[10,25,10,26],[10,27,10,28],[10,29,10,30],[10,31,10,32],[10,33,10,34],[7,1,7,3],[7,12,7,14],[7,15,7,17],[7,18,7,20],[7,23,7,34],[8,23,8,24],[8,25,8,26],[8,27,8,28],[8,29,8,30],[8,31,8,32],[8,33,8,34],[4,12,4,14],[4,15,4,17],[4,18,4,20],[4,35,4,36],[5,35,5,36],[6,1,6,3],[6,12,6,16],[6,17,6,20],[6,35,6,36],[1,37,1,38],[2,1,2,3],[2,23,2,24],[2,25,2,30],[2,31,2,36],[2,37,2,38],[3,12,3,16],[3,17,3,20],[3,35,3,36],[0,33,0,34],[0,35,0,36],[1,1,1,3],[1,12,1,14],[1,15,1,17],[1,18,1,20],[1,23,1,24],[1,25,1,26],[1,27,1,28],[1,29,1,30],[1,31,1,32],[1,33,1,34],[1,35,1,36],[0,0,0,3],[0,5,0,10],[0,12,0,16],[0,17,0,20],[0,23,0,24],[0,25,0,26],[0,27,0,28],[0,29,0,30],[0,31,0,32]]}
["角色基础信息",null,null,null,null,"基本属性",null,null,null,null,null,null,"体力（HP）",null,null,null,null,null,null,null,null,null,null,null,null,"基础阈值",null,"总阈值变动",null,"总奖励骰",null,"总鉴定值",null,"总伤害倍率奖励",null,"最终伤害倍率奖励"]
["姓名","大河原龙成",null,null,null,"力量","基础值","装备加成","成长","临时加成","最终值",null,"基础",null,null,"额外",null,null,"总值",null,null,null,null,"总调整值",null,51,null,{"$f":"SUMIFS(Z11:AA90,AH11:AI90,AH10)","v":30},null,{"$f":"SUMIFS(AB11:AC90,AH11:AI90,AH10)","v":2},null,{"$f":"SUMIFS(AD11:AE90,AH11:AI90,AH10)","v":-30},null,{"$f":"SUMIFS(AF11:AG90,AH11:AI90,AH10)","v":0.5},null,0]
["种族","鲸天狗",null,null,null,null,50,{"$f":"SUM(IF(INDIRECT(\"武器\"&\"!S1\")=INDIRECT(\"总表\"&\"!D29\"),INDIRECT(\"武器\"&\"!N5\")+INDIRECT(\"武器\"&\"!N12\"),IF(P12=INDIRECT(\"武器\"&\"!G3\"),INDIRECT(\"武器\"&\"!N5\"),INDIRECT(\"武器\"&\"!N12\"))),IF(I17>0,INDIRECT(\"防具\"&\"!I4\"),0),IF(I18>0,INDIRECT(\"防具\"&\"!I8\"),0),IF(I19>0,INDIRECT(\"防具\"&\"!I12\"),0),IF(I20>0,INDIRECT(\"防具\"&\"!I16\"),0),IF(AND(J21=D29,I22>0),INDIRECT(\"坐骑\"&\"!R4\"),0))","v":0},null,null,{"$f":"SUM(G3:J3)","v":50},null,45,"/",{"$f":"K7+INDIRECT(\"经历点数与履历\"&\"!E3\")","v":45},0,"/",0,{"$f":"M3+P3","v":45},"/",{"$f":"O3+R3","v":45},null,null,"输出格式",null,"（.rav基础阈值+总阈值变动：总奖励骰<总鉴定值）",null,null,null,null,null,"例：（.rav51+30：2<30）"]
["性别","男","身高","184cm",null,"敏捷","基础值","装备加成","成长","临时加成","最终值",null,"精神力（SP）"]
["年龄",387,"体重","78kg",null,null,50,{"$f":"SUM(IF(INDIRECT(\"武器\"&\"!S1\")=INDIRECT(\"总表\"&\"!D29\"),INDIRECT(\"武器\"&\"!O5\")+INDIRECT(\"武器\"&\"!O12\"),IF(P12=INDIRECT(\"武器\"&\"!G3\"),INDIRECT(\"武器\"&\"!O5\"),INDIRECT(\"武器\"&\"!O12\"))),IF(I17>0,INDIRECT(\"防具\"&\"!J4\"),0),IF(I18>0,INDIRECT(\"防具\"&\"!J8\"),0),IF(I19>0,INDIRECT(\"防具\"&\"!J12\"),0),IF(I20>0,INDIRECT(\"防具\"&\"!J16\"),0),IF(AND(J21=D29,I22>0),INDIRECT(\"坐骑\"&\"!S4\"),0))","v":0},null,null,{"$f":"SUM(G5:J5)","v":50},null,"基础",null,null,"额外",null,null,"总值"]
["惯用手","右手","信仰心","中等",null,"体质","基础值","装备加成","成长","临时加成","最终值",null,30,"/",{"$f":"K13","v":30},0,"/",0,{"$f":"M6+P6","v":30},"/",{"$f":"O6+R6","v":30}]
["信仰","大神教",null,null,null,null,40,{"$f":"SUM(IF(INDIRECT(\"武器\"&\"!S1\")=INDIRECT(\"总表\"&\"!D29\"),INDIRECT(\"武器\"&\"!P5\")+INDIRECT(\"武器\"&\"!P12\"),IF(P12=INDIRECT(\"武器\"&\"!G3\"),INDIRECT(\"武器\"&\"!P5\"),INDIRECT(\"武器\"&\"!P12\"))),IF(I17>0,INDIRECT(\"防具\"&\"!K4\"),0),IF(I18>0,INDIRECT(\"防具\"&\"!K8\"),0),IF(I19>0,INDIRECT(\"防具\"&\"!K12\"),0),IF(I20>0,INDIRECT(\"防具\"&\"!K16\"),0),IF(AND(J21=D29,I22>0),INDIRECT(\"坐骑\"&\"!T4\"),0))","v":0},null,null,{"$f":"SUM(G7:J7)","v":40},null,"行动点（AP）"]
["性格","较易冲动、自信、直率",null,null,null,"智力","基础值","装备加成","成长","临时加成","最终值",null,"基础",null,null,"敏捷+额外",null,null,"总值",null,null,null,null,"[PL战斗阈值速查卡ver0.1（手填）]"]
{"$rows_left_out":44}
{"sheet":"经历点数与履历","index":2,"n_rows":29,"n_cols":14,"rows_kept":29,"cut":false,"hidden":false,"merged":[[22,0,23,3],[22,4,23,7],[22,8,23,11],[24,0,25,3],[24,4,25,7],[24,8,25,11],[28,0,29,3],[28,4,29,7],[28,8,29,11],[26,0,27,3],[26,4,27,7],[26,8,27,11],[10,0,11,3],[10,4,11,7],[10,8,11,11],[2,13,29,22],[6,0,7,3],[6,4,7,7],[6,8,7,11],[20,0,21,3],[20,4,21,7],[20,8,21,11],[18,0,19,3],[18,4,19,7],[18,8,19,11],[16,0,17,3],[16,4,17,7],[16,8,17,11],[12,0,13,3],[12,4,13,7],[12,8,13,11],[14,0,15,3],[14,4,15,7],[14,8,15,11],[0,0,1,11],[0,13,1,22],[8,0,9,3],[8,4,9,7],[8,8,9,11],[4,0,5,2],[4,3,5,5],[4,6,5,8],[4,9,5,11],[2,0,3,3],[2,4,3,11]]}
["经历点",null,null,null,null,null,null,null,null,null,null,null,null,"履历"]
[]
["总经历点",null,null,null,{"$f":"SUMIF(E9:H591,\">=0\",E9:H591)","v":5},null,null,null,null,null,null,null,null,"天历前386年    诞生\n出生于天狗国飞津国大河原城。\n\n天历前26年    360岁\n成年，继承家业，加入飞津海卫，成为一名武士"]
[]
["基本经历点",null,null,{"$f":"E3-J5","v":5},null,null,"补偿经历点",null,null,{"$f":"E11","v":0}]
[]
["条目",null,null,null,"收支",null,null,null,"结余"]
[]
{"$rows_left_out":22}
{"sheet":"角色简介与天命","index":3,"n_rows":16,"n_cols":25,"rows_kept":16,"cut":false,"hidden":false,"merged":[[0,24,1,30],[2,24,24,30],[2,16,3,18],[2,19,3,22],[4,16,5,18],[6,16,7,18],[4,19,5,22],[6,19,7,22],[8,16,9,22],[0,0,1,6],[0,8,1,14],[0,16,1,22],[13,8,14,14],[2,0,24,6],[2,8,12,14],[15,8,16,14],[17,8,18,14],[19,8,20,14],[21,8,22,14],[23,8,24,14],[13,16,14,22],[10,16,12,22],[15,16,17,22]]}
["角色简介",null,null,null,null,null,null,null,"附加设定",null,null,null,null,null,null,null,"天命",null,null,null,null,null,null,null,"立绘"]
[]
["出生于天狗国外圈的平凡家族的鲸天狗。\n成年之后子承父业，成为了一名武士，守护着天狗国领海的安全。\n",null,null,null,null,null,null,null,null,null,null,null,null,null,null,null,"当前值",null,null,0]
[]
[null,null,null,null,null,null,null,null,null,null,null,null,null,null,null,null,"通用增加方式",null,null,"角色的主动提案拥有合理的解释，且被团队采纳，增加1点天命"]
[]
[null,null,null,null,null,null,null,null,null,null,null,null,null,null,null,null,"通用减少方式",null,null,"团队思考时间过长（空窗期超过5min），最后由npc指引行动，团队中所有人扣除1点天命"]
[]
{"$rows_left_out":9}
{"sheet":"角色专属技能","index":4,"n_rows":4,"n_cols":17,"rows_kept":4,"cut":false,"hidden":false,"merged":[[0,0,2,6],[0,8,2,14],[0,16,2,22],[3,0,26,6],[3,8,26,14],[3,16,26,22]]}
["顽强不屈",null,null,null,null,null,null,null,"热血沸腾",null,null,null,null,null,null,null,"薙刀世家"]
[]
[]
["受致命伤倒地后，进行体质检定时可恰一枚奖励骰",null,null,null,null,null,null,null,"亲手干掉一名敌人之后，本行动轮和下行动轮内全身护甲值+1，伤害+2",null,null,null,null,null,null,null,"使用薙刀作为武器时，可释放对周围若干格数所有敌人发动横扫的AOE技能（大风车），检定时只需投一次即可。"]

{"sheet":"武器","index":5,"n_rows":20,"n_cols":19,"rows_kept":20,"cut":false,"hidden":false,"merged":[[0,11,1,17],[0,18,1,19],[14,3,15,10],[12,3,13,10],[0,0,1,10],[9,0,15,1],[12,12,15,19],[5,12,8,19],[7,3,8,10],[5,3,6,10],[2,0,8,1],[5,2,6,2],[7,2,8,2],[12,2,13,2],[14,2,15,2],[5,11,8,11],[12,11,15,11],[9,13,9,18],[10,3,10,4],[10,6,10,7],[10,9,10,10],[11,3,11,4],[11,6,11,7],[11,9,11,10],[4,3,4,4],[4,6,4,7],[4,9,4,10],[9,3,9,4],[9,6,9,7],[9,9,9,10],[2,3,2,4],[2,6,2,7],[2,9,2,10],[2,13,2,18],[3,3,3,4],[3,6,3,7],[3,9,3,10]]}
["武器一览",null,null,null,null,null,null,null,null,null,null,"是否有无需切换武器也能享受特殊效果带来的增益",null,null,null,null,null,null,"×"]
[]
["主武器",null,"等级",1,null,"名称","近藤镇教",null,"类型","长柄刀",null,null,null,"若存在“有属性加成”词条"]
[null,null,"挂钩属性","力量",null,"力量阈值",25,null,"变体","薙刀",null,null,null,"力量加成","敏捷加成","体质加成","智力加成","魅力加成","魔力加成"]
[null,null,"攻击范围",3,null,"武器威力",8,null,"进攻衰减",{"$f":"ROUNDDOWN((20/144)*POWER(((INDIRECT(\"总表\"&\"!K3\")-G4)/5-12),2)+10,0)","v":16}]
[null,null,"特殊效果/印痕","若攻击处于长距离武器惩罚范围内的敌人，可用武器威力减半代替进攻阈值减半\n可以套上刀鞘，将造成伤害的一半转化为sp伤害，可花费1行动点切换",null,null,null,null,null,null,null,"升级记录\n印痕效果","注：若自身水平未达到武器要求，则在左侧填写武器完整的属性，在这里填写武器降级后的属性"]
[]
[null,null,"简介","御海行者标配薙刀"]
{"$rows_left_out":13}
{"sheet":"防具","index":6,"n_rows":18,"n_cols":21,"rows_kept":18,"cut":false,"hidden":false,"merged":[[0,0,1,13],[2,1,3,2],[8,1,9,2],[10,1,11,2],[4,1,5,2],[6,1,7,2],[2,0,5,0],[6,0,9,0],[10,0,13,0],[0,14,1,15],[0,16,1,17],[0,18,1,19],[14,15,17,22],[0,20,1,22],[2,15,5,22],[10,15,13,22],[6,15,9,22],[2,14,5,14],[6,14,9,14],[10,14,13,14],[14,14,17,14],[14,0,17,0],[4,3,4,13],[5,3,5,13],[8,3,8,13],[9,3,9,13],[12,3,12,13],[14,1,15,2],[16,1,17,2],[12,1,13,2],[13,3,13,13],[16,3,16,13],[17,3,17,13]]}
["防具一览",null,null,null,null,null,null,null,null,null,null,null,null,null,"平均力量阈值",null,{"$f":"FLOOR(AVERAGE(H4,H8,H12,H16),1)","v":20},null,"防守衰减",null,{"$f":"ROUNDDOWN((15/144)*POWER(((INDIRECT(\"总表\"&\"!K3\")-Q1)/5-12),2)+5,0)","v":8}]
[]
["头部","名称",null,"等级","护甲值","减伤","额外生命","力量阈值","力量加成","敏捷加成","体质加成","智力加成","魅力加成","魔力加成","升级记录\n印痕效果","注：若自身水平未达到防具要求，则在左侧填写防具完整的属性，在这里填写防具降级后的属性"]
[null,null,null,1,1,0.2,5,10]
[null,"斗笠",null,"特殊效果/印痕"]
[null,null,null,"无"]
["左右手","名称",null,"等级","护甲值","减伤","额外生命","力量阈值","力量加成","敏捷加成","体质加成","智力加成","魅力加成","魔力加成","升级记录\n印痕效果","注：若自身水平未达到防具要求，则在左侧填写防具完整的属性，在这里填写防具降级后的属性"]
[null,null,null,1,2,0.3,8,20]
{"$rows_left_out":11}
{"sheet":"各种技能","index":7,"n_rows":34,"n_cols":32,"rows_kept":34,"cut":false,"hidden":false,"merged":[[5,25,6,25],[5,29,6,29],[5,30,6,30],[5,31,6,31],[0,0,1,9],[0,22,1,31],[0,11,1,20],[2,7,2,9],[2,18,2,20],[2,29,2,31],[3,0,3,9],[3,11,3,20],[20,11,20,20],[25,0,25,9],[26,11,26,20],[29,0,29,9],[30,11,30,20],[7,0,7,9],[9,11,9,20],[13,0,13,9],[14,11,14,20],[18,0,18,9]]}
["泛用技能",null,null,null,null,null,null,null,null,null,null,"武器熟练度",null,null,null,null,null,null,null,null,null,null,"特殊技艺"]
[]
["名称","挂钩属性","属性值","熟练度","职业加成","社群加成","总阈值","经验值",null,null,null,"名称","挂钩属性","属性值","熟练度","职业加成","社群加成","总阈值","经验值",null,null,null,"名称","挂钩属性","属性值","熟练度","职业加成","社群加成","总阈值","经验值"]
["力量",null,null,null,null,null,null,null,null,null,null,"远程武器",null,null,null,null,null,null,null,null,null,null,"天狗语","智力",{"$f":"LOOKUP(INDIRECT(\"rc[-1]\",),INDIRECT(\"总表\"&\"!A29:A34\"),INDIRECT(\"总表\"&\"!B29:B34\"))","v":30},30,null,null,{"$f":"IF(SUM(Y4:AA4)<=50,SUM(Y4:AA4),IF(SUM(Y4:AA4)<=80,(SUM(Y4:AA4)-50)*0.7+50,(SUM(Y4:AA4)-80)*0.4+71))+AB4","v":57},0,"/",{"$f":"IF(Z4<10,\"6\",IF(Z4<20,\"9\",IF(Z4<30,\"12\",18)))","v":18}]
["防御","力量",{"$f":"LOOKUP(INDIRECT(\"rc[-1]\",),INDIRECT(\"总表\"&\"!A29:A34\"),INDIRECT(\"总表\"&\"!B29:B34\"))","v":50},1,null,null,{"$f":"IF(SUM(C5:E5)<=50,SUM(C5:E5),IF(SUM(C5:E5)<=80,(SUM(C5:E5)-50)*0.7+50,(SUM(C5:E5)-80)*0.4+71))+F5","v":50.7},0,"/",{"$f":"IF(D5<10,\"6\",IF(D5<20,\"9\",IF(D5<30,\"12\",18)))","v":"6"},null,"弓","力量",{"$f":"LOOKUP(INDIRECT(\"rc[-1]\",),INDIRECT(\"总表\"&\"!A29:A34\"),INDIRECT(\"总表\"&\"!B29:B34\"))","v":50},1,null,null,{"$f":"IF(SUM(N5:P5)<=50,SUM(N5:P5),IF(SUM(N5:P5)<=80,(SUM(N5:P5)-50)*0.7+50,(SUM(N5:P5)-80)*0.4+71))+Q5","v":50.7},0,"/",{"$f":"IF(O5<10,\"6\",IF(O5<20,\"9\",IF(O5<30,\"12\",18)))","v":"6"},null,"飞津方言","智力",{"$f":"LOOKUP(INDIRECT(\"rc[-1]\",),INDIRECT(\"总表\"&\"!A29:A34\"),INDIRECT(\"总表\"&\"!B29:B34\"))","v":30},30,null,null,{"$f":"IF(SUM(Y5:AA5)<=50,SUM(Y5:AA5),IF(SUM(Y5:AA5)<=80,(SUM(Y5:AA5)-50)*0.7+50,(SUM(Y5:AA5)-80)*0.4+71))+AB5","v":57},0,"/",18]
["搬运","力量",{"$f":"LOOKUP(INDIRECT(\"rc[-1]\",),INDIRECT(\"总表\"&\"!A29:A34\"),INDIRECT(\"总表\"&\"!B29:B34\"))","v":50},1,null,null,{"$f":"IF(SUM(C6:E6)<=50,SUM(C6:E6),IF(SUM(C6:E6)<=80,(SUM(C6:E6)-50)*0.7+50,(SUM(C6:E6)-80)*0.4+71))+F6","v":50.7},0,"/","6",null,"弩","敏捷",{"$f":"LOOKUP(INDIRECT(\"rc[-1]\",),INDIRECT(\"总表\"&\"!A29:A34\"),INDIRECT(\"总表\"&\"!B29:B34\"))","v":50},1,null,null,{"$f":"IF(SUM(N6:P6)<=50,SUM(N6:P6),IF(SUM(N6:P6)<=80,(SUM(N6:P6)-50)*0.7+50,(SUM(N6:P6)-80)*0.4+71))+Q6","v":50.7},0,"/","6",null,"驯兽检定","智力",30,1,null,null,31,0,"/","6"]
["缴械","力量",50,1,null,null,50.7,0,"/","6",null,"投掷","力量",50,1,null,null,50.7,0,"/","6",null,"坐骑检定","坐骑性能",{"$f":"坐骑!F4","v":25},null,null,null,{"$f":"IF(SUM(Y7,Z6,AA7)<=50,SUM(Y7,Z6,AA7),IF(SUM(Y7,Z6,AA7)<=80,(SUM(Y7,Z6,AA7)-50)*0.7+50,(SUM(Y7,Z6,AA7)-80)*0.4+71))+AB7","v":26}]
["敏捷",null,null,null,null,null,null,null,null,null,null,"发射器","敏捷",50,1,null,null,50.7,0,"/","6",null,null,"智力",30,1,null,null,31,0,"/","6"]
{"$rows_left_out":27}
{"sheet":"被动战技与战术","index":8,"n_rows":18,"n_cols":18,"rows_kept":18,"cut":false,"hidden":false,"merged":[[0,0,1,6],[6,2,7,6],[6,7,7,11],[6,12,7,16],[6,17,7,21],[12,0,13,6],[12,7,13,13],[12,14,13,20],[25,17,26,20],[15,17,16,20],[17,10,18,13],[17,17,18,20],[19,10,20,13],[19,17,20,20],[21,10,22,13],[21,17,22,20],[23,10,24,13],[23,17,24,20],[15,16,16,16],[17,16,18,16],[19,16,20,16],[21,16,22,16],[23,16,24,16],[25,16,26,16],[10,12,11,16],[23,3,24,6],[25,3,26,6],[19,3,20,6],[21,3,22,6],[15,3,16,6],[17,3,18,6],[15,10,16,13],[25,10,26,13],[15,14,16,14],[17,14,18,14],[19,14,20,14],[21,14,22,14],[23,14,24,14],[25,14,26,14],[15,15,16,15],[17,15,18,15],[19,15,20,15],[21,15,22,15],[23,15,24,15],[25,15,26,15],[15,8,16,8],[17,8,18,8],[19,8,20,8],[21,8,22,8],[23,8,24,8],[25,8,26,8],[15,9,16,9],[17,9,18,9],[19,9,20,9],[21,9,22,9],[23,9,24,9],[25,9,26,9],[15,2,16,2],[17,2,18,2],[19,2,20,2],[21,2,22,2],[23,2,24,2],[25,2,26,2],[15,7,16,7],[17,7,18,7],[19,7,20,7],[21,7,22,7],[23,7,24,7],[25,7,26,7],[15,0,16,0],[17,0,18,0],[19,0,20,0],[21,0,22,0],[23,0,24,0],[25,0,26,0],[4,1,5,1],[6,1,7,1],[8,1,9,1],[10,1,11,1],[15,1,16,1],[17,1,18,1],[19,1,20,1],[21,1,22,1],[23,1,24,1],[25,1,26,1],[2,0,2,1],[2,2,2,6],[3,2,3,6],[3,7,3,11],[3,12,3,16],[3,17,3,21],[14,3,14,6],[14,10,14,13],[14,17,14,20],[4,0,5,0],[6,0,7,0],[8,0,9,0],[10,0,11,0],[10,17,11,21],[8,2,9,6],[8,7,9,11],[8,12,9,16],[8,17,9,21],[4,2,5,6],[4,7,5,11],[4,12,5,16],[4,17,5,21],[10,2,11,6],[10,7,11,11]]}
["被动战术"]
[]
["战术奖励",null,{"$f":"IF(总表!C36=1,INT(INDIRECT(\"各种技能\"&\"!G21\")/6),INT(INDIRECT(\"各种技能\"&\"!G21\")/8))","v":3}]
["名称","等级","原始效果",null,null,null,null,"初级效果",null,null,null,null,"中级效果",null,null,null,null,"上级效果"]
["夹击","原始","符合夹击判定条件时，你进攻的检定阈值附加战术奖励",null,null,null,null,"若进攻成功，敌方露出一次破绽，仅对与你构成夹击的友方角色有效",null,null,null,null,"夹击状态下，无论你进攻成功与否，都可以让对手露出破绽",null,null,null,null,"夹击的队友无需与你构成直线"]
[]
["冲锋","原始","符合冲锋判定条件时，你进攻的检定阈值附加战术奖励","效果2",null,null,null,"你的友军不再阻碍你的冲锋，且你在冲锋过程中可以通过一些检定来越过障碍物",null,null,null,null,"你在冲锋过程中移动消耗的行动点减半",null,null,null,null,"进行冲锋前你可以进行移动\n一行动轮中，你每多进行一次冲锋，冲锋前就要多花费1行动点进行蓄势"]
[]
{"$rows_left_out":11}
{"sheet":"特殊战技与姿态战术","index":9,"n_rows":26,"n_cols":22,"rows_kept":26,"cut":false,"hidden":false,"merged":[[0,0,1,6],[4,2,5,6],[4,7,5,11],[4,12,5,16],[4,17,5,21],[3,17,3,21],[2,0,2,1],[2,2,2,6],[3,2,3,6],[3,7,3,11],[3,12,3,16],[25,21,26,21],[6,2,7,6],[6,7,7,11],[6,12,7,16],[6,17,7,21],[8,2,9,6],[8,7,9,11],[8,12,9,16],[8,17,9,21],[10,2,11,6],[10,7,11,11],[10,12,11,16],[10,17,11,21],[12,0,13,21],[15,3,16,15],[17,3,18,15],[15,21,16,21],[17,21,18,21],[19,21,20,21],[21,21,22,21],[23,21,24,21],[25,19,26,19],[15,20,16,20],[17,20,18,20],[19,20,20,20],[21,20,22,20],[23,20,24,20],[25,20,26,20],[15,19,16,19],[17,19,18,19],[19,19,20,19],[21,19,22,19],[23,19,24,19],[25,17,26,17],[15,18,16,18],[17,18,18,18],[19,18,20,18],[21,18,22,18],[23,18,24,18],[25,18,26,18],[15,17,16,17],[17,17,18,17],[19,17,20,17],[21,17,22,17],[23,17,24,17],[25,2,26,2],[15,16,16,16],[17,16,18,16],[19,16,20,16],[21,16,22,16],[23,16,24,16],[25,16,26,16],[19,3,20,15],[21,3,22,15],[23,3,24,15],[25,3,26,15],[15,2,16,2],[17,2,18,2],[19,2,20,2],[21,2,22,2],[23,2,24,2],[25,0,26,0],[4,1,5,1],[6,1,7,1],[8,1,9,1],[10,1,11,1],[15,1,16,1],[17,1,18,1],[19,1,20,1],[21,1,22,1],[23,1,24,1],[25,1,26,1],[15,0,16,0],[17,0,18,0],[19,0,20,0],[21,0,22,0],[23,0,24,0],[14,3,14,15],[14,17,14,19],[4,0,5,0],[6,0,7,0],[8,0,9,0],[10,0,11,0]]}
["战术"]
[]
["战术奖励",null,{"$f":"IF(总表!C36=1,INT(INDIRECT(\"各种技能\"&\"!G21\")/6),INT(INDIRECT(\"各种技能\"&\"!G21\")/8))","v":3}]
["名称","等级","原始效果",null,null,null,null,"初级效果",null,null,null,null,"中级效果",null,null,null,null,"上级效果"]
["强袭态势","原始","投入3点行动点，下行动轮你的第一次能够造成伤害的攻击阈值附加战术奖励",null,null,null,null,"下行动轮你的第一次能够造成伤害的攻击伤害变为1.5倍",null,null,null,null,"下行动轮你的进攻阈值衰减速度减半",null,null,null,null,"下行动轮你无视一切增加移动消耗的效果"]
[]
["蹲伏态势","原始","投入3点行动点，到下行动轮你的行动开始为止，你对抗远程攻击附加战术奖励",null,null,null,null,"你对抗直射时闪避阈值不再减半，对抗火器时的防御阈值也不再减半",null,null,null,null,"你可以花费1行动点蹲下（并非蹲伏姿态），来获得将半掩体视为全掩体的效果，不结束行动轮，但无法移动，可以再花费1行动点起身",null,null,null,null,"立刻进入潜行状态（若有“遁影”技能则进入隐身状态）"]
[]
{"$rows_left_out":19}
{"sheet":"魔法","index":10,"n_rows":47,"n_cols":28,"rows_kept":47,"cut":false,"hidden":false,"merged":[[0,8,1,18],[0,20,1,27],[2,2,3,6],[0,0,1,6],[5,3,7,6],[8,3,10,6],[13,3,15,6],[18,3,20,6],[3,10,4,12],[3,22,4,24],[11,10,12,12],[11,22,12,24],[9,10,10,12],[9,22,10,24],[3,27,4,27],[3,26,4,26],[5,26,6,26],[7,26,8,26],[9,26,10,26],[11,26,12,26],[13,26,14,26],[15,26,16,26],[17,26,18,26],[19,26,20,26],[23,10,24,12],[23,22,24,24],[21,10,22,12],[21,22,22,24],[19,10,20,12],[19,22,20,24],[27,10,28,12],[27,22,28,24],[13,10,14,12],[13,22,14,24],[25,10,26,12],[25,22,26,24],[21,20,22,20],[23,20,24,20],[25,20,26,20],[27,20,28,20],[21,21,22,21],[23,21,24,21],[25,21,26,21],[27,21,28,21],[21,17,22,17],[23,17,24,17],[25,17,26,17],[27,17,28,17],[21,27,22,27],[23,27,24,27],[25,27,26,27],[27,27,28,27],[17,10,18,12],[17,22,18,24],[15,10,16,12],[15,22,16,24],[5,10,6,12],[5,22,6,24],[7,10,8,12],[7,22,8,24],[5,27,6,27],[7,27,8,27],[9,27,10,27],[11,27,12,27],[13,27,14,27],[15,27,16,27],[17,27,18,27],[19,27,20,27],[21,25,22,25],[23,25,24,25],[25,25,26,25],[27,25,28,25],[21,26,22,26],[23,26,24,26],[25,26,26,26],[27,26,28,26],[3,25,4,25],[5,25,6,25],[7,25,8,25],[9,25,10,25],[11,25,12,25],[13,25,14,25],[15,25,16,25],[17,25,18,25],[19,25,20,25],[3,21,4,21],[5,21,6,21],[7,21,8,21],[9,21,10,21],[11,21,12,21],[13,21,14,21],[15,21,16,21],[17,21,18,21],[19,21,20,21],[3,20,4,20],[5,20,6,20],[7,20,8,20],[9,20,10,20],[11,20,12,20],[13,20,14,20],[15,20,16,20],[17,20,18,20],[19,20,20,20],[21,18,22,18],[23,18,24,18],[25,18,26,18],[27,18,28,18],[3,17,4,17],[5,17,6,17],[7,17,8,17],[9,17,10,17],[11,17,12,17],[13,17,14,17],[15,17,16,17],[17,17,18,17],[19,17,20,17],[3,18,4,18],[5,18,6,18],[7,18,8,18],[9,18,10,18],[11,18,12,18],[13,18,14,18],[15,18,16,18],[17,18,18,18],[19,18,20,18],[27,15,28,15],[3,16,4,16],[5,16,6,16],[7,16,8,16],[9,16,10,16],[11,16,12,16],[13,16,14,16],[15,16,16,16],[17,16,18,16],[19,16,20,16],[21,16,22,16],[23,16,24,16],[25,16,26,16],[27,16,28,16],[3,15,4,15],[5,15,6,15],[7,15,8,15],[9,15,10,15],[11,15,12,15],[13,15,14,15],[15,15,16,15],[17,15,18,15],[19,15,20,15],[21,15,22,15],[23,13,24,13],[25,13,26,13],[27,13,28,13],[3,14,4,14],[5,14,6,14],[7,14,8,14],[9,14,10,14],[11,14,12,14],[13,14,14,14],[15,14,16,14],[17,14,18,14],[19,14,20,14],[21,14,22,14],[23,14,24,14],[25,14,26,14],[27,14,28,14],[23,15,24,15],[25,15,26,15],[17,8,18,8],[19,8,20,8],[21,8,22,8],[23,8,24,8],[25,8,26,8],[27,8,28,8],[3,9,4,9],[5,9,6,9],[7,9,8,9],[9,9,10,9],[11,9,12,9],[13,9,14,9],[15,9,16,9],[17,9,18,9],[19,9,20,9],[21,9,22,9],[23,9,24,9],[25,9,26,9],[27,9,28,9],[17,13,18,13],[19,13,20,13],[21,13,22,13],[17,0,17,1],[17,2,17,6],[2,0,3,0],[5,0,7,0],[8,0,10,0],[13,0,15,0],[18,0,20,0],[21,0,28,0],[2,1,3,1],[5,1,7,1],[8,1,10,1],[13,1,15,1],[18,1,20,1],[5,2,7,2],[8,2,10,2],[13,2,15,2],[18,2,20,2],[2,10,2,12],[2,14,2,16],[2,22,2,24],[4,3,4,6],[11,0,11,1],[11,2,11,6],[12,0,12,1],[12,2,12,6],[16,0,16,1],[16,2,16,6],[3,8,4,8],[5,8,6,8],[7,8,8,8],[9,8,10,8],[11,8,12,8],[13,8,14,8],[15,8,16,8],[3,13,4,13],[5,13,6,13],[7,13,8,13],[9,13,10,13],[11,13,12,13],[13,13,14,13],[15,13,16,13]]}
["魔法通用效果",null,null,null,null,null,null,null,"漩涡/心神/塑形之法",null,null,null,null,null,null,null,null,null,null,null,"仪式之法"]
[]
["主修流派","仪式之法","若非主修流派，流派经验经验获取效率减半",null,null,null,null,null,"名称","魔法流派","效果",null,null,"熟练度","经验值",null,null,"消耗SP","总阈值",null,"名称","消耗SP","效果",null,null,"所需材料","准备时间","弱点"]
[null,null,null,null,null,null,null,null,null,"漩涡之法",null,null,null,1,0,"/",{"$f":"IF(N4<10,\"6\",IF(N4<20,\"9\",IF(N4<30,\"12\",18)))","v":"6"},5,{"$f":"IF(SUM(INDIRECT(\"总表\"&\"!K13\"),N4)<=50,SUM(INDIRECT(\"总表\"&\"!K13\"),N4),IF(SUM(INDIRECT(\"总表\"&\"!K13\"),N4)<=80,(SUM(INDIRECT(\"总表\"&\"!K13\"),N4)-50)*0.7+50,(SUM(INDIRECT(\"总表\"&\"!K13\"),N4)-80)*0.4+71))","v":31}]
["流派名称","流派经验","流派等级","流派效果"]
["漩涡之法",{"$f":"IF(B3=A6,SUMIF(J:N,A6,N:N),SUMIF(J:N,A6,N:N)/2)","v":0.5},{"$f":"IF(B6<15,1,IF(B6<45,2,IF(B6<105,3,IF(B6<165,4,5))))","v":1},{"$f":"IF(B6<15,\"允许连发（n连发所消耗的行动力就是2n）\",IF(B6<45,\"连发消耗行动力减半（n连发所消耗的行动力就是1+n）\",IF(B6<105,\"连发消耗行动力减半（n连发所消耗的行动力就是1+n）,允许跨魔法连发\",IF(B6<165,\"连发消耗行动力减半（n连发所消耗的行动力就是1+n）,允许跨魔法连发,连发消耗SP减半（首发SP全额，之后连发SP半额）\",\"连发消耗行动力减半（n连发所消耗的行动力就是1+n）,允许跨魔法连发,连发消耗SP减半（首发SP全额，之后连发SP半额）,允许免费获得1连发\"))))","v":"允许连发（n连发所消耗的行动力就是2n）"},null,null,null,null,null,"心神之法",null,null,null,1,0,"/",{"$f":"IF(N6<10,\"6\",IF(N6<20,\"9\",IF(N6<30,\"12\",18)))","v":"6"},5,{"$f":"IF(SUM(INDIRECT(\"总表\"&\"!K13\"),N6)<=50,SUM(INDIRECT(\"总表\"&\"!K13\"),N6),IF(SUM(INDIRECT(\"总表\"&\"!K13\"),N6)<=80,(SUM(INDIRECT(\"总表\"&\"!K13\"),N6)-50)*0.7+50,(SUM(INDIRECT(\"总表\"&\"!K13\"),N6)-80)*0.4+71))","v":31}]
[]
[null,null,null,null,null,null,null,null,null,"塑型之法",null,null,null,1,0,"/",{"$f":"IF(N8<10,\"6\",IF(N8<20,\"9\",IF(N8<30,\"12\",18)))","v":"6"},5,{"$f":"IF(SUM(INDIRECT(\"总表\"&\"!K13\"),N8)<=50,SUM(INDIRECT(\"总表\"&\"!K13\"),N8),IF(SUM(INDIRECT(\"总表\"&\"!K13\"),N8)<=80,(SUM(INDIRECT(\"总表\"&\"!K13\"),N8)-50)*0.7+50,(SUM(INDIRECT(\"总表\"&\"!K13\"),N8)-80)*0.4+71))","v":31}]
{"$rows_left_out":40}
{"sheet":"社群与职业","index":11,"n_rows":7,"n_cols":30,"rows_kept":7,"cut":false,"hidden":false,"merged":[[13,2,14,4],[15,2,16,4],[17,2,18,4],[17,0,18,0],[17,1,18,1],[13,0,14,0],[13,1,14,1],[15,0,16,0],[15,1,16,1],[9,0,10,0],[9,1,10,1],[11,0,12,0],[11,1,12,1],[9,2,10,4],[11,2,12,4],[15,13,16,17],[17,8,18,12],[17,13,18,17],[11,8,12,12],[11,13,12,17],[15,8,16,12],[17,6,18,6],[3,7,4,7],[5,7,6,7],[7,7,8,7],[9,7,10,7],[11,7,12,7],[13,7,14,7],[15,7,16,7],[17,7,18,7],[7,6,8,6],[9,6,10,6],[11,6,12,6],[13,6,14,6],[15,6,16,6],[2,8,2,12],[2,13,2,17],[0,6,1,17],[3,8,4,12],[3,13,4,17],[9,8,10,12],[9,13,10,17],[5,8,6,12],[5,13,6,17],[13,8,14,12],[13,13,14,17],[7,8,8,12],[7,13,8,17],[7,0,8,0],[7,1,8,1],[7,2,8,4],[3,0,4,0],[3,6,4,6],[5,6,6,6],[0,0,0,4],[1,1,1,2],[3,1,4,4],[6,2,6,4],[5,0,5,4]]}
["所属社群信息",null,null,null,null,null,"职业",null,null,null,null,null,null,null,null,null,null,null,null,null,null,null,null,null,null,null,{"$f":"INDIRECT(\"经历点数与履历\"&\"!D5\")*AA2*AA3","v":1600},null,0,200]
["所属社群","飞津海卫",null,"社群等级",7,null,null,null,null,null,null,null,null,null,null,null,null,null,null,null,null,null,null,null,null,null,{"$f":"LOOKUP(INDIRECT(\"经历点数与履历\"&\"!D5\"),AC1:AC6,AD1:AD6)","v":200},null,20,250]
["基础资金",{"$f":"AA1 & \"通\"","v":"1600通"},{"$f":"AA1/200 & \"贯\"","v":"8贯"},"消费水平","500文",null,"职业名称","职业等级","熟练技能",null,null,null,null,"职业特性",null,null,null,null,null,null,null,null,null,null,null,null,{"$f":"1+(E2-1)/10","v":1.6},null,25,300]
["总部地址","天狗国-飞津-大河原城",null,null,null,null,"武者",4,"长柄刀、搬运、缴械",null,null,null,null,"每行动轮多2次进入子弹时间的机会；每行动轮获得额外2点只可用于敌意行动的行动点。",null,null,null,null,null,null,null,null,null,null,null,null,null,null,30,350]
[null,null,null,null,null,null,null,null,null,null,null,null,null,null,null,null,null,null,null,null,null,null,null,null,null,null,null,null,35,400]
["物品栏",null,null,null,null,null,"武士",1,"长柄刀、搬运、抵抗、攀爬",null,null,null,null,"继承武者的职业特性；自带“卧薪尝胆”技能，且此技能对所有武器都生效。",null,null,null,null,null,null,null,null,null,null,null,null,null,null,40,450]
["物品名称","数量","效果"]

{"sheet":"坐骑","index":12,"n_rows":19,"n_cols":19,"rows_kept":19,"cut":false,"hidden":false,"merged":[[5,0,6,0],[7,0,8,0],[9,0,12,0],[0,0,1,8],[0,10,1,18],[4,10,5,11],[4,12,5,18],[5,1,6,8],[6,10,9,11],[6,12,9,18],[7,1,8,8],[9,1,12,8],[4,4,4,5],[4,7,4,8],[10,10,10,14],[10,15,10,18],[16,0,16,4],[16,5,16,8],[17,0,17,2],[17,3,17,5],[17,6,17,8],[13,0,13,4],[13,5,13,8],[14,0,14,2],[14,3,14,5],[14,6,14,8],[11,10,11,12],[11,13,11,15],[11,16,11,18],[2,1,2,2],[2,4,2,5],[2,7,2,8],[2,10,2,11],[3,1,3,2],[3,7,3,8],[3,10,3,11]]}
["坐骑",null,null,null,null,null,null,null,null,null,"坐骑防具"]
[]
["等级",1,null,"名称","矮脚马",null,"类型","马",null,null,"名称",null,"等级","护甲值","减伤","额外生命","性能阈值","性能加成","机动加成"]
["体力",20,null,"性能",25,{"$f":"E4+R4","v":25},"变体","战马",null,null,"马具套组",null,1,2,0.3,8,20,0,0]
["机动",8,{"$f":"B5+S4","v":8},"威力",{"$f":"E4/10","v":2.5},null,"防守衰减",{"$f":"ROUNDDOWN((17/144)*POWER(((F4-Q4)/5-12),2)+3,0)","v":17},null,null,"特殊效果",null,"无"]
["特殊效果","无"]
[null,null,null,null,null,null,null,null,null,null,"升级记录",null,"例如：护甲+1（1），减伤+5%，额外生命+3（1）"]
["简介","你坐骑的简介"]
{"$rows_left_out":11}